Username: Password: Remember me
Search + Advanced
Package Details

dolphin-emu 5.0-1
A Gamecube / Wii / Triforce emulator

Category: emulators

Maintainer: gcala
Votes: 11

License: GPL

Last Updated: 2016/09/11 - 08:10:39 +0000
First Submitted: 2011/08/26 - 16:46:37 +0000

Tarball :: PKGBUILD

Dependenciesbluez-libs enet ffmpeg libao libevdev mbedtls miniupnpc openal portaudio soundtouch wxgtk xdg-utils 


Comment by: elfasito on Sat, 07 Mar 2015 23:30:07 +0000

scanning dependencies of target common
[ 53%] Building CXX object Source/Core/Common/CMakeFiles/common.dir/Src/BreakPoints.cpp.o
In file included from /usr/lib/gcc/x86_64-unknown-linux-gnu/4.9.1/include/x86intrin.h:37:0,
                 from /usr/include/c++/4.9.1/x86_64-unknown-linux-gnu/bits/opt_random.h:33,
                 from /usr/include/c++/4.9.1/random:50,
                 from /usr/include/c++/4.9.1/bits/stl_algo.h:66,
                 from /usr/include/c++/4.9.1/algorithm:62,
                 from /tmp/ccrbuild-1000/dolphin-emu/dolphin-emu/src/dolphin/Source/Core/Common/Src/BreakPoints.cpp:11:
/usr/lib/gcc/x86_64-unknown-linux-gnu/4.9.1/include/tmmintrin.h: En la función ‘__m128i _mm_shuffle_epi8(__m128i, __m128i)’:
/usr/lib/gcc/x86_64-unknown-linux-gnu/4.9.1/include/tmmintrin.h:136:1: error: redefinición de ‘__m128i _mm_shuffle_epi8(__m128i, __m128i)’
 _mm_shuffle_epi8 (__m128i __X, __m128i __Y)
In file included from /tmp/ccrbuild-1000/dolphin-emu/dolphin-emu/src/dolphin/Source/Core/Common/Src/Common.h:49:0,
                 from /tmp/ccrbuild-1000/dolphin-emu/dolphin-emu/src/dolphin/Source/Core/Common/Src/BreakPoints.cpp:5:
/tmp/ccrbuild-1000/dolphin-emu/dolphin-emu/src/dolphin/Source/Core/Common/Src/CommonFuncs.h:36:1: nota: se define ‘__m128i _mm_shuffle_epi8(__m128i, __m128i)’ previamente aquí
 _mm_shuffle_epi8(__m128i a, __m128i mask)
Source/Core/Common/CMakeFiles/common.dir/build.make:54: fallo en las instrucciones para el objetivo 'Source/Core/Common/CMakeFiles/common.dir/Src/BreakPoints.cpp.o'
make[2]: *** [Source/Core/Common/CMakeFiles/common.dir/Src/BreakPoints.cpp.o] Error 1
CMakeFiles/Makefile2:491: fallo en las instrucciones para el objetivo 'Source/Core/Common/CMakeFiles/common.dir/all'
make[1]: *** [Source/Core/Common/CMakeFiles/common.dir/all] Error 2
Makefile:137: fallo en las instrucciones para el objetivo 'all'
make: *** [all] Error 2

Comment by: bulletfreak on Tue, 03 Jun 2014 23:49:47 +0000

Fails to build with error: /tmp/ccrbuild-1000/dolphin-emu/dolphin-emu/PKGBUILD: line 45: cd: /tmp/ccrbuild-1000/dolphin-emu/dolphin-emu/src/dolphin-emu/build: No such file or directory
==> ERROR: A failure occurred in package().
The build failed.

Comment by: Ram-Z on Tue, 12 Nov 2013 23:12:07 +0000

In the following thread we announced that GTK application will no longer reside in /extra.

This package seems to be installed into /extra or depend on filesystem-extra.

Please adapt your PKGBUILD:
1. install into /
2. remove the dependency on filesystem-extra

PS: The list of packages still using /extra has been generated automatically, and this comment sent in bulk. If you think it was sent in error, just ignore it, or contact me or any other TU.

Comment by: gcala on Sun, 06 Oct 2013 08:53:15 +0000

It requires cmake >=, currently in testing

Comment by: kote on Sun, 29 Sep 2013 08:36:25 +0000

4.0 out!