Username: Password: Remember me
Search + Advanced
Package Details

cairo-infinality-ultimate 1.14.2-1
http://cairographics.org/
Cairo vector graphics library with respect-fontconfig, expose and Ubuntu patches (infinality-bundle)

Category: lib

Submitter: UtG
Maintainer: UtG
Votes: 1

License: LGPL MPL

Last Updated: 2015/05/24 - 15:16:30 +0000
First Submitted: 2014/03/06 - 00:21:55 +0000

Tarball :: PKGBUILD

Dependenciesfontconfig>=2.8.0 glib2 libgl libpng>=1.6.0 libxext libxrender lzo2 mesa>=9.0 pixman>=0.28.0 sh 

Required by lib32-cairo-infinality-ultimate

Sources

Comment by: whoami on Tue, 15 Jul 2014 23:04:46 +0000


Hi man!

I've this problem:

libtool: link: cannot find the library `/usr/lib/libfontconfig.la' or unhandled argument `/usr/lib/libfontconfig.la'
make[4]: *** [any2ppm] Errore 1
make[4]: Leaving directory `/tmp/ccrbuild-1000/cairo-infinality-ultimate/cairo-infinality-ultimate/src/cairo-1.12.16/test'
make[3]: *** [all-recursive] Errore 1
make[3]: Leaving directory `/tmp/ccrbuild-1000/cairo-infinality-ultimate/cairo-infinality-ultimate/src/cairo-1.12.16/test'
make[2]: *** [all] Errore 2
make[2]: Leaving directory `/tmp/ccrbuild-1000/cairo-infinality-ultimate/cairo-infinality-ultimate/src/cairo-1.12.16/test'
make[1]: *** [all-recursive] Errore 1
make[1]: Leaving directory `/tmp/ccrbuild-1000/cairo-infinality-ultimate/cairo-infinality-ultimate/src/cairo-1.12.16'
make: *** [all] Errore 2
==> ERRORE: Si è verificato un errore in build().
    L'operazione sta per essere interrotta...
The build failed.

Ideas?
Thanks!

Comment by: UtG on Mon, 21 Apr 2014 23:48:30 +0000


PKG updated

Comment by: UtG on Sat, 08 Mar 2014 01:46:19 +0000


My fault!

Comment by: FranzMari on Fri, 07 Mar 2014 08:22:49 +0000


The build fails http://paste.chakra-project.org/6599/